Target
Fibroblast growth factor receptor 3
Ligand
BDBM357698
Substrate
Meas. Tech.
Enzymatic Assay
IC50
>200±n/a nM
Citation
 Lu, LWu, LQian, DYao, W Bicyclic heterocycles as FGFR4 inhibitors US Patent  US11014923 Publication Date 5/25/2021 
Target
Name:
Fibroblast growth factor receptor 3
Synonyms:
CD_antigen: CD333 FGFR3 Fibroblast growth factor receptor JTK4
Type:
Protein
Mol. Mass.:
87699.57
Organism:
Homo sapiens (Human)
Description:
P22607
Residue:
806
  
Inhibitor
Name:
BDBM357698
Synonyms:
N-((3-(2,6-difluoro-3,5-dimethoxyphenyl)-1-ethyl-2-oxo-1,2,3,4-tetrahydropyrido[4,3-d]pyrimidin-7-yl)methyl)acrylamide US10738048, Example 2 US11667635, Example 2 | US9890156, Example 2
Type:
Small organic molecule
Emp. Form.:
C21H22F2N4O4
Mol. Mass.:
432.4206
SMILES:
CCN1C(=O)N(Cc2cnc(CNC(=O)C=C)cc12)c1c(F)c(OC)cc(OC)c1F
: