Target
Fibroblast growth factor receptor 4
Ligand
BDBM357699
Substrate
Meas. Tech.
Enzymatic Assay
IC50
20±n/a nM
Citation
 Lu, LWu, LQian, DYao, W Bicyclic heterocycles as FGFR4 inhibitors US Patent  US11014923 Publication Date 5/25/2021 
Target
Name:
Fibroblast growth factor receptor 4
Synonyms:
CD_antigen: CD334 FGFR4 FGFR4 Fibroblast growth factor receptor JK2 TKF
Type:
Protein
Mol. Mass.:
87957.45
Organism:
Homo sapiens (Human)
Description:
P22455
Residue:
802
  
Inhibitor
Name:
BDBM357699
Synonyms:
N-((3-(2,6-difluoro-3,5-dimethoxyphenyl)-2-oxo-1-(pyridin-3-yl)-1,2,3,4-tetrahydropyrido[4,3-d]pyrimidin-7-yl)methyl)acrylamide US10738048, Example 3 US11667635, Example 3 | US9890156, Example 3
Type:
Small organic molecule
Emp. Form.:
C24H21F2N5O4
Mol. Mass.:
481.4514
SMILES:
COc1cc(OC)c(F)c(N2Cc3cnc(CNC(=O)C=C)cc3N(C2=O)c2cccnc2)c1F
: