Target
Fibroblast growth factor receptor 1
Ligand
BDBM357701
Substrate
Meas. Tech.
Enzymatic Assay
IC50
>200±n/a nM
Citation
 Lu, LWu, LQian, DYao, W Bicyclic heterocycles as FGFR4 inhibitors US Patent  US11014923 Publication Date 5/25/2021 
Target
Name:
Fibroblast growth factor receptor 1
Synonyms:
BFGFR Basic fibroblast growth factor receptor 1 (FGFR1) CEK FGFR-1 FGFR-1, (FL) FGFR1_HUMAN FLT2 Fibroblast growth factor receptor 1 (FGFR-1) Fms-like tyrosine kinase 2 N-sam bFGF-R | c-fgr
Type:
Receptor
Mol. Mass.:
91861.70
Organism:
Homo sapiens (Human)
Description:
P11362
Residue:
822
  
Inhibitor
Name:
BDBM357701
Synonyms:
N-((2′-(2,6-difluoro-3,5-dimethoxyphenyl)-3′-oxo-2′,3′-dihydro-1H-spiro[cyclopentane-1,4′-[2,7]naphthyridine]-6′-yl)methyl)acrylamide US10738048, Example 5 US11667635, Example 5 | US9890156, Example 5
Type:
Small organic molecule
Emp. Form.:
C24H25F2N3O4
Mol. Mass.:
457.4698
SMILES:
COc1cc(OC)c(F)c(N2Cc3cnc(CNC(=O)C=C)cc3C3(CCCC3)C2=O)c1F
: