Target
Fibroblast growth factor receptor 4
Ligand
BDBM357714
Substrate
Meas. Tech.
Enzymatic Assay
IC50
<10±n/a nM
Citation
 Lu, LWu, LQian, DYao, W Bicyclic heterocycles as FGFR4 inhibitors US Patent  US11014923 Publication Date 5/25/2021 
Target
Name:
Fibroblast growth factor receptor 4
Synonyms:
CD_antigen: CD334 FGFR4 FGFR4 Fibroblast growth factor receptor JK2 TKF
Type:
Protein
Mol. Mass.:
87957.45
Organism:
Homo sapiens (Human)
Description:
P22455
Residue:
802
  
Inhibitor
Name:
BDBM357714
Synonyms:
N-((3-(2,6-difluoro-3,5-dimethoxyphenyl)-1-((1-methyl-1H-pyrazol-4-yl)methyl)-2-oxo-1,2,3,4-tetrahydropyrido[4,3-d]pyrimidin-7-yl)methyl)acrylamide US10738048, Example 18 US11667635, Example 18 | US9890156, Example 18
Type:
Small organic molecule
Emp. Form.:
C24H24F2N6O4
Mol. Mass.:
498.482
SMILES:
COc1cc(OC)c(F)c(N2Cc3cnc(CNC(=O)C=C)cc3N(Cc3cnn(C)c3)C2=O)c1F
: