Target
Fibroblast growth factor receptor 2
Ligand
BDBM357728
Substrate
Meas. Tech.
Enzymatic Assay
IC50
>200±n/a nM
Citation
 Lu, LWu, LQian, DYao, W Bicyclic heterocycles as FGFR4 inhibitors US Patent  US11014923 Publication Date 5/25/2021 
Target
Name:
Fibroblast growth factor receptor 2
Synonyms:
BEK FGFR-2 FGFR2 Fibroblast growth factor receptor 2 (FGFR2) KGFR Keratinocyte growth factor receptor VEGF-receptor 2 and Fibroblast growth factor receptor 2
Type:
Enzyme
Mol. Mass.:
92015.45
Organism:
Homo sapiens (Human)
Description:
P21802
Residue:
821
  
Inhibitor
Name:
BDBM357728
Synonyms:
N-((3-(2,6-difluoro-3,5-dimethoxyphenyl)-1-((1-methylpiperidin-4-yl)methyl)-2-oxo-1,2,3,4-tetrahydropyrido[4,3-d]pyrimidin-7-yl)methyl)acrylamide US10738048, Example 32 US11667635, Example 32 | US9890156, Example 32
Type:
Small organic molecule
Emp. Form.:
C26H31F2N5O4
Mol. Mass.:
515.5522
SMILES:
COc1cc(OC)c(F)c(N2Cc3cnc(CNC(=O)C=C)cc3N(CC3CCN(C)CC3)C2=O)c1F
: