Target
Fibroblast growth factor receptor 3
Ligand
BDBM357731
Substrate
Meas. Tech.
Enzymatic Assay
IC50
>200±n/a nM
Citation
 Lu, LWu, LQian, DYao, W Bicyclic heterocycles as FGFR4 inhibitors US Patent  US11014923 Publication Date 5/25/2021 
Target
Name:
Fibroblast growth factor receptor 3
Synonyms:
CD_antigen: CD333 FGFR3 Fibroblast growth factor receptor JTK4
Type:
Protein
Mol. Mass.:
87699.57
Organism:
Homo sapiens (Human)
Description:
P22607
Residue:
806
  
Inhibitor
Name:
BDBM357731
Synonyms:
N-((3-(2,6-difluoro-3,5-dimethoxyphenyl)-1-((1-(methylsulfonyl)piperidin-4-yl)methyl)-2-oxo-1,2,3,4-tetrahydropyrido[4,3-d]pyrimidin-7-yl)methyl)acrylamide US10738048, Example 35 US11667635, Example 35 | US9890156, Example 35
Type:
Small organic molecule
Emp. Form.:
C26H31F2N5O6S
Mol. Mass.:
579.616
SMILES:
COc1cc(OC)c(F)c(N2Cc3cnc(CNC(=O)C=C)cc3N(CC3CCN(CC3)S(C)(=O)=O)C2=O)c1F
: