Target
Fibroblast growth factor receptor 4
Ligand
BDBM357697
Substrate
Meas. Tech.
Enzymatic Assay 2
IC50
<10±n/a nM
Citation
 Lu, LWu, LQian, DYao, W Bicyclic heterocycles as FGFR4 inhibitors US Patent  US11014923 Publication Date 5/25/2021 
Target
Name:
Fibroblast growth factor receptor 4
Synonyms:
CD_antigen: CD334 FGFR4 FGFR4 Fibroblast growth factor receptor JK2 TKF
Type:
Protein
Mol. Mass.:
87957.45
Organism:
Homo sapiens (Human)
Description:
P22455
Residue:
802
  
Inhibitor
Name:
BDBM357697
Synonyms:
N-{[2′-(2,6-difluoro-3,5-dimethoxyphenyl)-3′-oxo-2′,3′-dihydro-1′H-spiro[cyclopropane-1,4′-[2,7]naphthyridin]6′-yl]methyl}acrylamide US10738048, Example 1 US11667635, Example 1 | US9890156, Example 1
Type:
Small organic molecule
Emp. Form.:
C22H21F2N3O4
Mol. Mass.:
429.4166
SMILES:
COc1cc(OC)c(F)c(N2Cc3cnc(CNC(=O)C=C)cc3C3(CC3)C2=O)c1F
: