Target
Mitogen-activated protein kinase kinase kinase kinase 1
Ligand
BDBM499033
Substrate
Meas. Tech.
Kinase Binding Assay
Ki
<50±n/a nM
Citation
 Vechorkin, OLiu, KPan, JSokolsky, AYe, HFYe, QYao, WHummel, J Pyrazolopyrimidine compounds and uses thereof US Patent  US11014929 Publication Date 5/25/2021 
Target
Name:
Mitogen-activated protein kinase kinase kinase kinase 1
Synonyms:
HPK1 MAP4K1
Type:
PROTEIN
Mol. Mass.:
91316.07
Organism:
Homo sapiens (Human)
Description:
ChEMBL_586597
Residue:
833
  
Inhibitor
Name:
BDBM499033
Synonyms:
US11014929, Example 71 | US11542265, Example 71
Type:
Small organic molecule
Emp. Form.:
C25H27F2N7O
Mol. Mass.:
479.525
SMILES:
CNCc1cc(F)c(c(F)c1)-c1ncc2[nH]nc(-c3ccc(nc3)N3CCCC(C)(CO)C3)c2n1
: