Target
Mitogen-activated protein kinase kinase kinase kinase 1
Ligand
BDBM499037
Substrate
Meas. Tech.
Kinase Binding Assay
Ki
<50±n/a nM
Citation
 Vechorkin, OLiu, KPan, JSokolsky, AYe, HFYe, QYao, WHummel, J Pyrazolopyrimidine compounds and uses thereof US Patent  US11014929 Publication Date 5/25/2021 
Target
Name:
Mitogen-activated protein kinase kinase kinase kinase 1
Synonyms:
HPK1 MAP4K1
Type:
PROTEIN
Mol. Mass.:
91316.07
Organism:
Homo sapiens (Human)
Description:
ChEMBL_586597
Residue:
833
  
Inhibitor
Name:
BDBM499037
Synonyms:
US11014929, Example 75 | US11542265, Example 75
Type:
Small organic molecule
Emp. Form.:
C26H29F2N9O
Mol. Mass.:
521.565
SMILES:
CCN(C)C(=O)N1CCN(CC1)c1ccc(cn1)-c1n[nH]c2cnc(nc12)-c1c(F)cc(CNC)cc1F
: