Target
Mitogen-activated protein kinase kinase kinase kinase 1
Ligand
BDBM499062
Substrate
Meas. Tech.
Kinase Binding Assay
Ki
<50±n/a nM
Citation
 Vechorkin, OLiu, KPan, JSokolsky, AYe, HFYe, QYao, WHummel, J Pyrazolopyrimidine compounds and uses thereof US Patent  US11014929 Publication Date 5/25/2021 
Target
Name:
Mitogen-activated protein kinase kinase kinase kinase 1
Synonyms:
HPK1 MAP4K1
Type:
PROTEIN
Mol. Mass.:
91316.07
Organism:
Homo sapiens (Human)
Description:
ChEMBL_586597
Residue:
833
  
Inhibitor
Name:
BDBM499062
Synonyms:
US11014929, Example 100 | US11542265, Example 100
Type:
Small organic molecule
Emp. Form.:
C26H29N7O
Mol. Mass.:
455.5548
SMILES:
COc1ccc(c2CCNCc12)-c1ncc2[nH]nc(-c3ccc(cc3)N3CCN(C)CC3)c2n1
: