Target
Proto-oncogene tyrosine-protein kinase receptor Ret
Ligand
BDBM370352
Substrate
Meas. Tech.
Inhibitory Activity Assay
IC50
8.50±n/a nM
Citation
 Miyazaki, IShimamura, TKato, MFujita, H Fused pyrimidine compound or salt thereof US Patent  US11014930 Publication Date 5/25/2021 
Target
Name:
Proto-oncogene tyrosine-protein kinase receptor Ret
Synonyms:
CDHF12 Cadherin family member 12 Proto-oncogene c-Ret RET51 Tyrosine-protein kinase Ret (RET)
Type:
Protein
Mol. Mass.:
124318.29
Organism:
Homo sapiens (Human)
Description:
P07949
Residue:
1114
  
Inhibitor
Name:
BDBM370352
Synonyms:
US10233189, Example 7 US11014930, Example 7 | US11236096, Example 7
Type:
Small organic molecule
Emp. Form.:
C17H20N8O
Mol. Mass.:
352.3937
SMILES:
Nc1ncnc2n(nc(C(=O)Nc3cc([nH]n3)C3CC3)c12)C1CCCC1
: