Target
Proto-oncogene tyrosine-protein kinase receptor Ret
Ligand
BDBM370380
Substrate
Meas. Tech.
Inhibitory Activity Assay
IC50
3.20±n/a nM
Citation
 Miyazaki, IShimamura, TKato, MFujita, H Fused pyrimidine compound or salt thereof US Patent  US11014930 Publication Date 5/25/2021 
Target
Name:
Proto-oncogene tyrosine-protein kinase receptor Ret
Synonyms:
CDHF12 Cadherin family member 12 Proto-oncogene c-Ret RET51 Tyrosine-protein kinase Ret (RET)
Type:
Protein
Mol. Mass.:
124318.29
Organism:
Homo sapiens (Human)
Description:
P07949
Residue:
1114
  
Inhibitor
Name:
BDBM370380
Synonyms:
US10233189, Example 18 US11014930, Example 18 | US11236096, Example 18
Type:
Small organic molecule
Emp. Form.:
C14H16N8O
Mol. Mass.:
312.3298
SMILES:
Cc1cc(NC(=O)c2nn(CC3CC3)c3ncnc(N)c23)n[nH]1
: