Target
Proto-oncogene tyrosine-protein kinase receptor Ret
Ligand
BDBM464423
Substrate
Meas. Tech.
Inhibitory Activity Assay
IC50
0.279±n/a nM
Citation
 Miyazaki, IShimamura, TKato, MFujita, H Fused pyrimidine compound or salt thereof US Patent  US11014930 Publication Date 5/25/2021 
Target
Name:
Proto-oncogene tyrosine-protein kinase receptor Ret
Synonyms:
CDHF12 Cadherin family member 12 Proto-oncogene c-Ret RET51 Tyrosine-protein kinase Ret (RET)
Type:
Protein
Mol. Mass.:
124318.29
Organism:
Homo sapiens (Human)
Description:
P07949
Residue:
1114
  
Inhibitor
Name:
BDBM464423
Synonyms:
US10787457, Example 56 | US11014930, Example 56
Type:
Small organic molecule
Emp. Form.:
C18H19N7OS
Mol. Mass.:
381.455
SMILES:
Cc1cc(NC(=O)c2cn(c3ncnc(N)c23)C(C)(C)c2cccs2)n[nH]1
: