Target
Proto-oncogene tyrosine-protein kinase receptor Ret
Ligand
BDBM370402
Substrate
Meas. Tech.
Inhibitory Activity Assay
IC50
0.270±n/a nM
Citation
 Miyazaki, IShimamura, TKato, MFujita, H Fused pyrimidine compound or salt thereof US Patent  US11014930 Publication Date 5/25/2021 
Target
Name:
Proto-oncogene tyrosine-protein kinase receptor Ret
Synonyms:
CDHF12 Cadherin family member 12 Proto-oncogene c-Ret RET51 Tyrosine-protein kinase Ret (RET)
Type:
Protein
Mol. Mass.:
124318.29
Organism:
Homo sapiens (Human)
Description:
P07949
Residue:
1114
  
Inhibitor
Name:
BDBM370402
Synonyms:
US10233189, Example 58 US11014930, Example 58 | US11236096, Example 58
Type:
Small organic molecule
Emp. Form.:
C16H17N7O
Mol. Mass.:
323.3525
SMILES:
Cc1cc(NC(=O)c2cn(c3ncnc(N)c23)C23CC(C2)C3)n[nH]1
: