Target
Proto-oncogene tyrosine-protein kinase receptor Ret
Ligand
BDBM499143
Substrate
Meas. Tech.
Inhibitory Activity Assay
IC50
0.150±n/a nM
Citation
 Miyazaki, IShimamura, TKato, MFujita, H Fused pyrimidine compound or salt thereof US Patent  US11014930 Publication Date 5/25/2021 
Target
Name:
Proto-oncogene tyrosine-protein kinase receptor Ret
Synonyms:
CDHF12 Cadherin family member 12 Proto-oncogene c-Ret RET51 Tyrosine-protein kinase Ret (RET)
Type:
Protein
Mol. Mass.:
124318.29
Organism:
Homo sapiens (Human)
Description:
P07949
Residue:
1114
  
Inhibitor
Name:
BDBM499143
Synonyms:
US11014930, Example 66
Type:
Small organic molecule
Emp. Form.:
C14H15BrFN7O
Mol. Mass.:
396.218
SMILES:
CC(C)(CF)n1cc(C(=O)Nc2cc(Br)[nH]n2)c2c(N)ncnc12
: