Target
Proto-oncogene tyrosine-protein kinase receptor Ret
Ligand
BDBM370351
Substrate
Meas. Tech.
Inhibitory Activity Assay
IC50
0.460±n/a nM
Citation
 Miyazaki, IShimamura, TKato, MFujita, H Fused pyrimidine compound or salt thereof US Patent  US11014930 Publication Date 5/25/2021 
Target
Name:
Proto-oncogene tyrosine-protein kinase receptor Ret
Synonyms:
CDHF12 Cadherin family member 12 Proto-oncogene c-Ret RET51 Tyrosine-protein kinase Ret (RET)
Type:
Protein
Mol. Mass.:
124318.29
Organism:
Homo sapiens (Human)
Description:
P07949
Residue:
1114
  
Inhibitor
Name:
BDBM370351
Synonyms:
US10233189, Example 69 US11014930, Example 69 | US11236096, Example 69
Type:
Small organic molecule
Emp. Form.:
C15H17N7O
Mol. Mass.:
311.3418
SMILES:
Cc1cc(NC(=O)c2cn(C3CCC3)c3ncnc(N)c23)n[nH]1
: