Target
Proto-oncogene tyrosine-protein kinase receptor Ret
Ligand
BDBM499152
Substrate
Meas. Tech.
Inhibitory Activity Assay
IC50
<0.150±n/a nM
Citation
 Miyazaki, IShimamura, TKato, MFujita, H Fused pyrimidine compound or salt thereof US Patent  US11014930 Publication Date 5/25/2021 
Target
Name:
Proto-oncogene tyrosine-protein kinase receptor Ret
Synonyms:
CDHF12 Cadherin family member 12 Proto-oncogene c-Ret RET51 Tyrosine-protein kinase Ret (RET)
Type:
Protein
Mol. Mass.:
124318.29
Organism:
Homo sapiens (Human)
Description:
P07949
Residue:
1114
  
Inhibitor
Name:
BDBM499152
Synonyms:
US11014930, Example 75
Type:
Small organic molecule
Emp. Form.:
C15H16ClN7O
Mol. Mass.:
345.787
SMILES:
Cc1cc(NC(=O)c2c(Cl)n(c3ncnc(N)c23)C2(C)CC2)n[nH]1
: