Target
Proto-oncogene tyrosine-protein kinase receptor Ret
Ligand
BDBM499160
Substrate
Meas. Tech.
Inhibitory Activity Assay
IC50
0.170±n/a nM
Citation
 Miyazaki, IShimamura, TKato, MFujita, H Fused pyrimidine compound or salt thereof US Patent  US11014930 Publication Date 5/25/2021 
Target
Name:
Proto-oncogene tyrosine-protein kinase receptor Ret
Synonyms:
CDHF12 Cadherin family member 12 Proto-oncogene c-Ret RET51 Tyrosine-protein kinase Ret (RET)
Type:
Protein
Mol. Mass.:
124318.29
Organism:
Homo sapiens (Human)
Description:
P07949
Residue:
1114
  
Inhibitor
Name:
BDBM499160
Synonyms:
US11014930, Example 83
Type:
Small organic molecule
Emp. Form.:
C21H21N9O
Mol. Mass.:
415.4511
SMILES:
Cc1cc(NC(=O)c2c(C#Cc3cncn3C)n(c3ncnc(N)c23)C2(C)CC2)n[nH]1
: