Target
Serine protease HTRA1
Ligand
BDBM499089
Substrate
Meas. Tech.
Enzyme Inhibition Assay
IC50
1.20±n/a nM
Citation
 Hornsperger, BIacone, RMaerki, HPMohr, PReutlinger, M Trifluoromethylpropanamide derivatives as HTRA1 inhibitors US Patent  US11014963 Publication Date 5/25/2021 
Target
Name:
Serine protease HTRA1
Synonyms:
HTRA HTRA1_HUMAN | PRSS11
Type:
Protein
Mol. Mass.:
51293.95
Organism:
Homo sapiens (Human)
Description:
Q92743
Residue:
480
  
Inhibitor
Name:
BDBM499089
Synonyms:
N-[(2S)-3-(3-Chlorophenyl)-1-[[(1S)-1-(4-methoxyphenyl)-2-oxo-2-[[(3S)-1,1,1-trifluoro-4-methyl-2-oxopentan-3-yl]amino]ethyl]amino]-1-oxopropan-2-yl]benzamide | US11014963, Example 1
Type:
Small organic molecule
Emp. Form.:
C31H31ClF3N3O5
Mol. Mass.:
618.043
SMILES:
COc1ccc(cc1)[C@H](NC(=O)[C@H](Cc1cccc(Cl)c1)NC(=O)c1ccccc1)C(=O)N[C@@H](C(C)C)C(=O)C(F)(F)F
: