Target
Serine protease HTRA1
Ligand
BDBM499127
Substrate
Meas. Tech.
Enzyme Inhibition Assay
IC50
1.60±n/a nM
Citation
 Hornsperger, BIacone, RMaerki, HPMohr, PReutlinger, M Trifluoromethylpropanamide derivatives as HTRA1 inhibitors US Patent  US11014963 Publication Date 5/25/2021 
Target
Name:
Serine protease HTRA1
Synonyms:
HTRA HTRA1_HUMAN | PRSS11
Type:
Protein
Mol. Mass.:
51293.95
Organism:
Homo sapiens (Human)
Description:
Q92743
Residue:
480
  
Inhibitor
Name:
BDBM499127
Synonyms:
US11014963, Example 34
Type:
Small organic molecule
Emp. Form.:
C26H27ClF5N3O5
Mol. Mass.:
591.955
SMILES:
COc1ccc(cc1)[C@H](NC(=O)[C@@H](C)NC(=O)C(F)(F)c1ccc(Cl)cc1)C(=O)N[C@@H](C(C)C)C(=O)C(F)(F)F
: