Target
Serine protease HTRA1
Ligand
BDBM499264
Substrate
Meas. Tech.
Enzyme Inhibition Assay
IC50
0.602±n/a nM
Citation
 Hornsperger, BIacone, RMaerki, HPMohr, PReutlinger, M Trifluoromethylpropanamide derivatives as HTRA1 inhibitors US Patent  US11014963 Publication Date 5/25/2021 
Target
Name:
Serine protease HTRA1
Synonyms:
HTRA HTRA1_HUMAN | PRSS11
Type:
Protein
Mol. Mass.:
51293.95
Organism:
Homo sapiens (Human)
Description:
Q92743
Residue:
480
  
Inhibitor
Name:
BDBM499264
Synonyms:
US11014963, Example 163
Type:
Small organic molecule
Emp. Form.:
C33H42ClF3N4O7
Mol. Mass.:
699.157
SMILES:
COc1ccc(cc1)[C@H](NC(=O)[C@H](CCCCNC(=O)OC(C)(C)C)NC(=O)c1cccc(Cl)c1)C(=O)N[C@@H](C(C)C)C(=O)C(F)(F)F
: