Target
CREB-binding protein
Ligand
BDBM437289
Substrate
Meas. Tech.
In Vitro CBP Inhibition
IC50
<500±n/a nM
Citation
 Trzoss, LBetancort, JMKanouni, TWallace, MBBoloor, A Therapeutic compounds US Patent  US11020380 Publication Date 6/1/2021 
Target
Name:
CREB-binding protein
Synonyms:
CBP CREB-binding protein (CBP) CREBBP
Type:
Transcription Coactivator
Mol. Mass.:
265411.66
Organism:
Homo sapiens (Human)
Description:
Q92793
Residue:
2442
  
Inhibitor
Name:
BDBM437289
Synonyms:
5-(1-(1-(3-chlorophenyl)ethyl)-1H-pyrazol-4-yl)- 1-methylpyridin-2(1H)-one US11020380, Example 23
Type:
Small organic molecule
Emp. Form.:
C17H16ClN3O
Mol. Mass.:
313.781
SMILES:
CC(c1cccc(Cl)c1)n1cc(cn1)-c1ccc(=O)n(C)c1
: