Target
CREB-binding protein
Ligand
BDBM437327
Substrate
Meas. Tech.
In Vitro CBP Inhibition
IC50
<500±n/a nM
Citation
 Trzoss, LBetancort, JMKanouni, TWallace, MBBoloor, A Therapeutic compounds US Patent  US11020380 Publication Date 6/1/2021 
Target
Name:
CREB-binding protein
Synonyms:
CBP CREB-binding protein (CBP) CREBBP
Type:
Transcription Coactivator
Mol. Mass.:
265411.66
Organism:
Homo sapiens (Human)
Description:
Q92793
Residue:
2442
  
Inhibitor
Name:
BDBM437327
Synonyms:
(R)-1-methyl-5-(1-(1-phenylethyl)-1H-pyrazol-4-yl)-4-(1H- pyrazol-1-yl)pyridin-2(1H)-one US11020380, Example 61
Type:
Small organic molecule
Emp. Form.:
C20H19N5O
Mol. Mass.:
345.3978
SMILES:
C[C@H](c1ccccc1)n1cc(cn1)-c1cn(C)c(=O)cc1-n1cccn1
: