Target
CREB-binding protein
Ligand
BDBM437344
Substrate
Meas. Tech.
In Vitro CBP Inhibition
IC50
<500±n/a nM
Citation
 Trzoss, LBetancort, JMKanouni, TWallace, MBBoloor, A Therapeutic compounds US Patent  US11020380 Publication Date 6/1/2021 
Target
Name:
CREB-binding protein
Synonyms:
CBP CREB-binding protein (CBP) CREBBP
Type:
Transcription Coactivator
Mol. Mass.:
265411.66
Organism:
Homo sapiens (Human)
Description:
Q92793
Residue:
2442
  
Inhibitor
Name:
BDBM437344
Synonyms:
1-(5-(1-benzyl-1H-pyrazol-4-yl)-1-methyl-2-oxo-1,2- dihydropyridin-4-yl)-N,N-dimethyl-1H-pyrrole-3-carboxamide US11020380, Example 78
Type:
Small organic molecule
Emp. Form.:
C23H23N5O2
Mol. Mass.:
401.461
SMILES:
CN(C)C(=O)c1ccn(c1)-c1cc(=O)n(C)cc1-c1cnn(Cc2ccccc2)c1
: