Target
CREB-binding protein
Ligand
BDBM437433
Substrate
Meas. Tech.
In Vitro CBP Inhibition
IC50
<500±n/a nM
Citation
 Trzoss, LBetancort, JMKanouni, TWallace, MBBoloor, A Therapeutic compounds US Patent  US11020380 Publication Date 6/1/2021 
Target
Name:
CREB-binding protein
Synonyms:
CBP CREB-binding protein (CBP) CREBBP
Type:
Transcription Coactivator
Mol. Mass.:
265411.66
Organism:
Homo sapiens (Human)
Description:
Q92793
Residue:
2442
  
Inhibitor
Name:
BDBM437433
Synonyms:
US10617680, Example 167 [5-(1-Benzyl-1H-pyrazol-4-yl)-1-methyl-2-oxo-1,2- dihydro-pyridin-4-yloxy]-acetonitrile
Type:
Small organic molecule
Emp. Form.:
C18H16N4O2
Mol. Mass.:
320.3452
SMILES:
Cn1cc(-c2cnn(Cc3ccccc3)c2)c(OCC#N)cc1=O
: