Target
CREB-binding protein
Ligand
BDBM437447
Substrate
Meas. Tech.
In Vitro CBP Inhibition
IC50
<500±n/a nM
Citation
 Trzoss, LBetancort, JMKanouni, TWallace, MBBoloor, A Therapeutic compounds US Patent  US11020380 Publication Date 6/1/2021 
Target
Name:
CREB-binding protein
Synonyms:
CBP CREB-binding protein (CBP) CREBBP
Type:
Transcription Coactivator
Mol. Mass.:
265411.66
Organism:
Homo sapiens (Human)
Description:
Q92793
Residue:
2442
  
Inhibitor
Name:
BDBM437447
Synonyms:
4-ethoxy-1-methyl-5-(1-(1-(methylsulfonyl)piperidin-3- yl)-1H-pyrazol-4-yl)pyridin-2(1H)-one US11020380, Example 181
Type:
Small organic molecule
Emp. Form.:
C17H24N4O4S
Mol. Mass.:
380.462
SMILES:
CCOc1cc(=O)n(C)cc1-c1cnn(c1)C1CCCN(C1)S(C)(=O)=O
: