Target
CREB-binding protein
Ligand
BDBM437449
Substrate
Meas. Tech.
In Vitro CBP Inhibition
IC50
<500±n/a nM
Citation
 Trzoss, LBetancort, JMKanouni, TWallace, MBBoloor, A Therapeutic compounds US Patent  US11020380 Publication Date 6/1/2021 
Target
Name:
CREB-binding protein
Synonyms:
CBP CREB-binding protein (CBP) CREBBP
Type:
Transcription Coactivator
Mol. Mass.:
265411.66
Organism:
Homo sapiens (Human)
Description:
Q92793
Residue:
2442
  
Inhibitor
Name:
BDBM437449
Synonyms:
2-[4-(4-Ethoxy-1-methyl-6-oxo-1,6-dihydro-pyridin-3-yl)- pyrazol-1-yl]-4-phenoxy-benzonitrile US11020380, Example 183
Type:
Small organic molecule
Emp. Form.:
C24H20N4O3
Mol. Mass.:
412.4406
SMILES:
CCOc1cc(=O)n(C)cc1-c1cnn(c1)-c1cc(Oc2ccccc2)ccc1C#N
: