Target
CREB-binding protein
Ligand
BDBM437502
Substrate
Meas. Tech.
In Vitro CBP Inhibition
IC50
<500±n/a nM
Citation
 Trzoss, LBetancort, JMKanouni, TWallace, MBBoloor, A Therapeutic compounds US Patent  US11020380 Publication Date 6/1/2021 
Target
Name:
CREB-binding protein
Synonyms:
CBP CREB-binding protein (CBP) CREBBP
Type:
Transcription Coactivator
Mol. Mass.:
265411.66
Organism:
Homo sapiens (Human)
Description:
Q92793
Residue:
2442
  
Inhibitor
Name:
BDBM437502
Synonyms:
2-[4-(6-Isobutoxy-1'-methyl-6'-oxo-1',6'-dihydro- [3,4']bipyridinyl-3'-yl)-pyrazol-1-yl]-benzonitrile US11020380, Example 236
Type:
Small organic molecule
Emp. Form.:
C25H23N5O2
Mol. Mass.:
425.4824
SMILES:
CC(C)COc1ccc(cn1)-c1cc(=O)n(C)cc1-c1cnn(c1)-c1ccccc1C#N
: