Target
CREB-binding protein
Ligand
BDBM437503
Substrate
Meas. Tech.
In Vitro CBP Inhibition
IC50
<500±n/a nM
Citation
 Trzoss, LBetancort, JMKanouni, TWallace, MBBoloor, A Therapeutic compounds US Patent  US11020380 Publication Date 6/1/2021 
Target
Name:
CREB-binding protein
Synonyms:
CBP CREB-binding protein (CBP) CREBBP
Type:
Transcription Coactivator
Mol. Mass.:
265411.66
Organism:
Homo sapiens (Human)
Description:
Q92793
Residue:
2442
  
Inhibitor
Name:
BDBM437503
Synonyms:
2-[4-(1'-Methyl-6'-oxo-1',6'-dihydro-[3,4']bipyridinyl-3'- yl)-pyrazol-1-yl]-benzonitrile US11020380, Example 237
Type:
Small organic molecule
Emp. Form.:
C21H15N5O
Mol. Mass.:
353.3767
SMILES:
Cn1cc(-c2cnn(c2)-c2ccccc2C#N)c(cc1=O)-c1cccnc1
: