Target
CREB-binding protein
Ligand
BDBM437533
Substrate
Meas. Tech.
In Vitro CBP Inhibition
IC50
<500±n/a nM
Citation
 Trzoss, LBetancort, JMKanouni, TWallace, MBBoloor, A Therapeutic compounds US Patent  US11020380 Publication Date 6/1/2021 
Target
Name:
CREB-binding protein
Synonyms:
CBP CREB-binding protein (CBP) CREBBP
Type:
Transcription Coactivator
Mol. Mass.:
265411.66
Organism:
Homo sapiens (Human)
Description:
Q92793
Residue:
2442
  
Inhibitor
Name:
BDBM437533
Synonyms:
4-Methoxy-2-[4-(1-methyl-6-oxo-4-phenyl-1,6-dihydro- pyridin-3-yl)-pyrazol-1-yl]-benzoic acid US11020380, Example 267
Type:
Small organic molecule
Emp. Form.:
C23H19N3O4
Mol. Mass.:
401.4147
SMILES:
COc1ccc(C(O)=O)c(c1)-n1cc(cn1)-c1cn(C)c(=O)cc1-c1ccccc1
: