Target
CREB-binding protein
Ligand
BDBM437603
Substrate
Meas. Tech.
In Vitro CBP Inhibition
IC50
<500±n/a nM
Citation
 Trzoss, LBetancort, JMKanouni, TWallace, MBBoloor, A Therapeutic compounds US Patent  US11020380 Publication Date 6/1/2021 
Target
Name:
CREB-binding protein
Synonyms:
CBP CREB-binding protein (CBP) CREBBP
Type:
Transcription Coactivator
Mol. Mass.:
265411.66
Organism:
Homo sapiens (Human)
Description:
Q92793
Residue:
2442
  
Inhibitor
Name:
BDBM437603
Synonyms:
2-chloro-6-(4-(1-methyl-4-(2-(4-methylpiperazin-1- yl)pyrimidin-5-yl)-6-oxo-1,6-dihydropyridin-3-yl)-1H- pyrazol-1-yl)benzonitrile US11020380, Example 337
Type:
Small organic molecule
Emp. Form.:
C25H23ClN8O
Mol. Mass.:
486.956
SMILES:
CN1CCN(CC1)c1ncc(cn1)-c1cc(=O)n(C)cc1-c1cnn(c1)-c1cccc(Cl)c1C#N
: