Target
Sodium channel protein type 9 subunit alpha
Ligand
BDBM499361
Substrate
Meas. Tech.
EFS-FRET Assay
IC50
<500±n/a nM
Citation
 Kawamura, KYamagishi, TShishido, YMorita, MYamaguchi, ROhmi, M Biaryloxy derivatives as TTX-S blockers US Patent  US11020381 Publication Date 6/1/2021 
Target
Name:
Sodium channel protein type 9 subunit alpha
Synonyms:
NENA Peripheral sodium channel 1 SCN9A_HUMAN Voltage-gated sodium channel subunit Nav1.7 hNE-Na
Type:
Protein
Mol. Mass.:
226375.97
Organism:
Homo sapiens (Human)
Description:
Q15858
Residue:
1988
  
Inhibitor
Name:
BDBM499361
Synonyms:
4-((3-(6- (cyclopropylmethoxy)pyridin-3- yl)phenoxy)methyl)-N- (ethylsulfonyl)-3- fluorobenzamide | US11020381, Example 52
Type:
Small organic molecule
Emp. Form.:
C25H25FN2O5S
Mol. Mass.:
484.54
SMILES:
CCS(=O)(=O)NC(=O)c1ccc(COc2cccc(c2)-c2ccc(OCC3CC3)nc2)c(F)c1
: