Target
Sodium channel protein type 9 subunit alpha
Ligand
BDBM499386
Substrate
Meas. Tech.
EFS-FRET Assay
IC50
<500±n/a nM
Citation
 Kawamura, KYamagishi, TShishido, YMorita, MYamaguchi, ROhmi, M Biaryloxy derivatives as TTX-S blockers US Patent  US11020381 Publication Date 6/1/2021 
Target
Name:
Sodium channel protein type 9 subunit alpha
Synonyms:
NENA Peripheral sodium channel 1 SCN9A_HUMAN Voltage-gated sodium channel subunit Nav1.7 hNE-Na
Type:
Protein
Mol. Mass.:
226375.97
Organism:
Homo sapiens (Human)
Description:
Q15858
Residue:
1988
  
Inhibitor
Name:
BDBM499386
Synonyms:
4-(cyclopropylmethoxy)-3'-((2- fluoro-4- ((methylsulfonyl)carbamoyl) benzyl)oxy)-N,N-methyl-[1,1'- biphenyl]-3-carboxamide | US11020381, Example 82
Type:
Small organic molecule
Emp. Form.:
C28H29FN2O6S
Mol. Mass.:
540.603
SMILES:
CN(C)C(=O)c1cc(ccc1OCC1CC1)-c1cccc(OCc2ccc(cc2F)C(=O)NS(C)(=O)=O)c1
: