Target
Sodium channel protein type 9 subunit alpha
Ligand
BDBM499455
Substrate
Meas. Tech.
EFS-FRET Assay
IC50
<500±n/a nM
Citation
 Kawamura, KYamagishi, TShishido, YMorita, MYamaguchi, ROhmi, M Biaryloxy derivatives as TTX-S blockers US Patent  US11020381 Publication Date 6/1/2021 
Target
Name:
Sodium channel protein type 9 subunit alpha
Synonyms:
NENA Peripheral sodium channel 1 SCN9A_HUMAN Voltage-gated sodium channel subunit Nav1.7 hNE-Na
Type:
Protein
Mol. Mass.:
226375.97
Organism:
Homo sapiens (Human)
Description:
Q15858
Residue:
1988
  
Inhibitor
Name:
BDBM499455
Synonyms:
4-((3-(2- (cyclopropylmethoxy)pyrimidin- 5-yl)phenoxy)methyl)-3-fluoro-N- (methylsulfonyl)benzamide | US11020381, Example 152
Type:
Small organic molecule
Emp. Form.:
C23H22FN3O5S
Mol. Mass.:
471.501
SMILES:
CS(=O)(=O)NC(=O)c1ccc(COc2cccc(c2)-c2cnc(OCC3CC3)nc2)c(F)c1
: