Target
Sodium channel protein type 9 subunit alpha
Ligand
BDBM499466
Substrate
Meas. Tech.
EFS-FRET Assay
IC50
<500±n/a nM
Citation
 Kawamura, KYamagishi, TShishido, YMorita, MYamaguchi, ROhmi, M Biaryloxy derivatives as TTX-S blockers US Patent  US11020381 Publication Date 6/1/2021 
Target
Name:
Sodium channel protein type 9 subunit alpha
Synonyms:
NENA Peripheral sodium channel 1 SCN9A_HUMAN Voltage-gated sodium channel subunit Nav1.7 hNE-Na
Type:
Protein
Mol. Mass.:
226375.97
Organism:
Homo sapiens (Human)
Description:
Q15858
Residue:
1988
  
Inhibitor
Name:
BDBM499466
Synonyms:
4-(((3'-(cyclopropylmethoxy)- 5-fluoro-5'- (((2-hydroxyethyl) (methyl)amino)methyl)- [1,1'-biphenyl]-3-yl) oxy)methyl)-3- fluoro-N-(methylsulfonyl) benzamide | US11020381, Example 166
Type:
Small organic molecule
Emp. Form.:
C29H32F2N2O6S
Mol. Mass.:
574.636
SMILES:
CN(CCO)Cc1cc(OCC2CC2)cc(c1)-c1cc(F)cc(OCc2ccc(cc2F)C(=O)NS(C)(=O)=O)c1
: