Target
Sodium channel protein type 9 subunit alpha
Ligand
BDBM499478
Substrate
IC50
>3000000±n/a nM
Citation
 Kawamura, KYamagishi, TShishido, YMorita, MYamaguchi, ROhmi, M Biaryloxy derivatives as TTX-S blockers US Patent  US11020381 Publication Date 6/1/2021 
Target
Name:
Sodium channel protein type 9 subunit alpha
Synonyms:
NENA Peripheral sodium channel 1 SCN9A_HUMAN Voltage-gated sodium channel subunit Nav1.7 hNE-Na
Type:
Protein
Mol. Mass.:
226375.97
Organism:
Homo sapiens (Human)
Description:
Q15858
Residue:
1988
  
Inhibitor
Name:
BDBM499478
Synonyms:
US11020381, WO2012/007868 Reference compound (A)
Type:
Small organic molecule
Emp. Form.:
C20H18N2O4S
Mol. Mass.:
382.433
SMILES:
CS(=O)(=O)NC(=O)c1ccc(COc2cccc(c2)-c2cccnc2)cc1
: