Target
Sodium channel protein type 9 subunit alpha
Ligand
BDBM499313
Substrate
IC50
80.0±n/a nM
Citation
 Kawamura, KYamagishi, TShishido, YMorita, MYamaguchi, ROhmi, M Biaryloxy derivatives as TTX-S blockers US Patent  US11020381 Publication Date 6/1/2021 
Target
Name:
Sodium channel protein type 9 subunit alpha
Synonyms:
NENA Peripheral sodium channel 1 SCN9A_HUMAN Voltage-gated sodium channel subunit Nav1.7 hNE-Na
Type:
Protein
Mol. Mass.:
226375.97
Organism:
Homo sapiens (Human)
Description:
Q15858
Residue:
1988
  
Inhibitor
Name:
BDBM499313
Synonyms:
4-((3-(6- (cydopropylmethoxy)pyridin-3- yl)phenoxy)methyl)-N- (rnethylsulfonyl)benzamide | US11020381, Example 2
Type:
Small organic molecule
Emp. Form.:
C24H24N2O5S
Mol. Mass.:
452.523
SMILES:
CS(=O)(=O)NC(=O)c1ccc(COc2cccc(c2)-c2ccc(OCC3CC3)nc2)cc1
: