Target
Apelin receptor
Ligand
BDBM499505
Substrate
Meas. Tech.
[35S]GTPgammaS Binding
EC50
2.00±n/a nM
Citation
 Chen, YDransfield, PJHarvey, JSHeath, JAHouze, JKhakoo, AYKopecky, DJLai, SMa, ZNishimura, NPattaropong, VSwaminath, GYeh, WRamsden, PD Cycloalkyl substituted triazole compounds as agonists of the APJ receptor US Patent  US11020395 Publication Date 6/1/2021 
Target
Name:
Apelin receptor
Synonyms:
AGTRL1 APJ_HUMAN Angiotensin receptor-like 1 Apelin receptor (APJ) G-protein coupled receptor HG11
Type:
Enzyme Catalytic Domain
Mol. Mass.:
42664.06
Organism:
Homo sapiens (Human)
Description:
P35414
Residue:
380
  
Inhibitor
Name:
BDBM499505
Synonyms:
US11020395, Example 87.0
Type:
Small organic molecule
Emp. Form.:
C21H26ClN7O4S
Mol. Mass.:
507.994
SMILES:
COc1ncnc(OC)c1-n1c(NS(=O)(=O)[C@@H](C)[C@H](C)c2ccc(Cl)cn2)nnc1C1CCC1
: