Target
Apelin receptor
Ligand
BDBM499558
Substrate
Meas. Tech.
[35S]GTPgammaS Binding
EC50
0.180±n/a nM
Citation
 Chen, YDransfield, PJHarvey, JSHeath, JAHouze, JKhakoo, AYKopecky, DJLai, SMa, ZNishimura, NPattaropong, VSwaminath, GYeh, WRamsden, PD Cycloalkyl substituted triazole compounds as agonists of the APJ receptor US Patent  US11020395 Publication Date 6/1/2021 
Target
Name:
Apelin receptor
Synonyms:
AGTRL1 APJ_HUMAN Angiotensin receptor-like 1 Apelin receptor (APJ) G-protein coupled receptor HG11
Type:
Enzyme Catalytic Domain
Mol. Mass.:
42664.06
Organism:
Homo sapiens (Human)
Description:
P35414
Residue:
380
  
Inhibitor
Name:
BDBM499558
Synonyms:
US11020395, Example 153.0 | US11020395, Example 154.0
Type:
Small organic molecule
Emp. Form.:
C22H26Cl2N6O5S
Mol. Mass.:
557.45
SMILES:
CO[C@@H]([C@H](C)S(=O)(=O)Nc1nnc([C@H]2C[C@H](Cl)C2)n1-c1c(OC)cccc1OC)c1ncc(Cl)cn1
: