Target
Apelin receptor
Ligand
BDBM499590
Substrate
Meas. Tech.
[35S]GTPgammaS Binding
EC50
1.10±n/a nM
Citation
 Chen, YDransfield, PJHarvey, JSHeath, JAHouze, JKhakoo, AYKopecky, DJLai, SMa, ZNishimura, NPattaropong, VSwaminath, GYeh, WRamsden, PD Cycloalkyl substituted triazole compounds as agonists of the APJ receptor US Patent  US11020395 Publication Date 6/1/2021 
Target
Name:
Apelin receptor
Synonyms:
AGTRL1 APJ_HUMAN Angiotensin receptor-like 1 Apelin receptor (APJ) G-protein coupled receptor HG11
Type:
Enzyme Catalytic Domain
Mol. Mass.:
42664.06
Organism:
Homo sapiens (Human)
Description:
P35414
Residue:
380
  
Inhibitor
Name:
BDBM499590
Synonyms:
US11020395, Example 184.0
Type:
Small organic molecule
Emp. Form.:
C23H29ClN8O5S
Mol. Mass.:
565.045
SMILES:
CO[C@@H]([C@H](C)S(=O)(=O)Nc1nnc(C2CC3(CCC3)C2)n1-c1c(OC)ncnc1OC)c1ncc(Cl)cn1
: