Target
Apelin receptor
Ligand
BDBM499635
Substrate
Meas. Tech.
[35S]GTPgammaS Binding
EC50
12.0±n/a nM
Citation
 Chen, YDransfield, PJHarvey, JSHeath, JAHouze, JKhakoo, AYKopecky, DJLai, SMa, ZNishimura, NPattaropong, VSwaminath, GYeh, WRamsden, PD Cycloalkyl substituted triazole compounds as agonists of the APJ receptor US Patent  US11020395 Publication Date 6/1/2021 
Target
Name:
Apelin receptor
Synonyms:
AGTRL1 APJ_HUMAN Angiotensin receptor-like 1 Apelin receptor (APJ) G-protein coupled receptor HG11
Type:
Enzyme Catalytic Domain
Mol. Mass.:
42664.06
Organism:
Homo sapiens (Human)
Description:
P35414
Residue:
380
  
Inhibitor
Name:
BDBM499635
Synonyms:
US11020395, Example 233.0 US11020395, Example 235.0
Type:
Small organic molecule
Emp. Form.:
C27H38N6O6S
Mol. Mass.:
574.692
SMILES:
CO[C@H]1CCC[C@H]1c1nnc(NS(=O)(=O)[C@@H](C)[C@@H](OC(C)C)c2ncc(C)cn2)n1-c1c(OC)cccc1OC
: