Target
Xanthine dehydrogenase/oxidase
Ligand
BDBM499650
Substrate
Meas. Tech.
xanthine oxidase activity assay
IC50
>300±n/a nM
Citation
 Warrell, Jr., RPPiwinski, JJLarivée, ASiddiqui, AThai, K Compounds and their use for reducing uric acid levels US Patent  US11020397 Publication Date 6/1/2021 
Target
Name:
Xanthine dehydrogenase/oxidase
Synonyms:
XD XDHA XO Xanthine dehydrogenase/oxidase | Xanthine oxidase
Type:
Enzyme
Mol. Mass.:
146441.21
Organism:
Homo sapiens (Human)
Description:
P47989
Residue:
1333
  
Inhibitor
Name:
BDBM499650
Synonyms:
US11020397, Compound Formula-(IIj)
Type:
Small organic molecule
Emp. Form.:
C14H9F3N6O3S
Mol. Mass.:
398.32
SMILES:
Oc1nc(SC(F)(F)F)[nH]c(=O)c1C(=O)Nc1ccc(cc1)-c1c[nH]nn1
: