Target
Xanthine dehydrogenase/oxidase
Ligand
BDBM499654
Substrate
Meas. Tech.
xanthine oxidase activity assay
IC50
3.57±n/a nM
Citation
 Warrell, Jr., RPPiwinski, JJLarivée, ASiddiqui, AThai, K Compounds and their use for reducing uric acid levels US Patent  US11020397 Publication Date 6/1/2021 
Target
Name:
Xanthine dehydrogenase/oxidase
Synonyms:
XD XDHA XO Xanthine dehydrogenase/oxidase | Xanthine oxidase
Type:
Enzyme
Mol. Mass.:
146441.21
Organism:
Homo sapiens (Human)
Description:
P47989
Residue:
1333
  
Inhibitor
Name:
BDBM499654
Synonyms:
US11020397, Compound Formula-(IIn)
Type:
Small organic molecule
Emp. Form.:
C16H16N6O3S
Mol. Mass.:
372.402
SMILES:
CC(C)Sc1nc(O)c(C(=O)Nc2ccc(cc2)-c2nnc[nH]2)c(=O)[nH]1
: