Target
Solute carrier family 22 member 12
Ligand
BDBM499659
Substrate
Meas. Tech.
URAT1 activity assay
IC50
>3500±n/a nM
Citation
 Warrell, Jr., RPPiwinski, JJLarivée, ASiddiqui, AThai, K Compounds and their use for reducing uric acid levels US Patent  US11020397 Publication Date 6/1/2021 
Target
Name:
Solute carrier family 22 member 12
Synonyms:
OATL4 RST S22AC_HUMAN Solute carrier family 22 member 12 URAT1 Urate anion exchanger 1 (URAT1) | Uric Acid Transporter 1 (URAT1)
Type:
Enzyme
Mol. Mass.:
59638.65
Organism:
Homo sapiens (Human)
Description:
Q96S37
Residue:
553
  
Inhibitor
Name:
BDBM499659
Synonyms:
US11020397, Compound Formula-(IIs)
Type:
Small organic molecule
Emp. Form.:
C14H11FN6O3S
Mol. Mass.:
362.339
SMILES:
CSc1nc(O)c(C(=O)Nc2ccc(cc2F)-c2c[nH]nn2)c(=O)[nH]1
: