Target
Solute carrier family 22 member 12
Ligand
BDBM499670
Substrate
Meas. Tech.
URAT1 activity assay
IC50
>90000±n/a nM
Citation
 Warrell, Jr., RPPiwinski, JJLarivée, ASiddiqui, AThai, K Compounds and their use for reducing uric acid levels US Patent  US11020397 Publication Date 6/1/2021 
Target
Name:
Solute carrier family 22 member 12
Synonyms:
OATL4 RST S22AC_HUMAN Solute carrier family 22 member 12 URAT1 Urate anion exchanger 1 (URAT1) | Uric Acid Transporter 1 (URAT1)
Type:
Enzyme
Mol. Mass.:
59638.65
Organism:
Homo sapiens (Human)
Description:
Q96S37
Residue:
553
  
Inhibitor
Name:
BDBM499670
Synonyms:
US11020397, Compound Formula-(IIaa)
Type:
Small organic molecule
Emp. Form.:
C14H10F2N6O3S
Mol. Mass.:
380.329
SMILES:
CSc1nc(O)c(C(=O)Nc2ccc(-c3c[nH]nn3)c(F)c2F)c(=O)[nH]1
: