Target
Tyrosine-protein kinase BTK
Ligand
BDBM499790
Substrate
Meas. Tech.
Mobility Shift Assay (MSA) Type A
IC50
1.90±n/a nM
Citation
 Bates, CEathiraj, SInagaki, HLapierre, JMomose, TNakayama, KOdagiri, TOta, MOta, YShibata, YTandon, MTsunemi, T Amino-pyrrolopyrimidinone compounds and methods of use thereof US Patent  US11020398 Publication Date 6/1/2021 
Target
Name:
Tyrosine-protein kinase BTK
Synonyms:
AGMX1 Agammaglobulinaemia tyrosine kinase B cell progenitor kinase BPK BTK_HUMAN Tyrosine Kinase BTK Tyrosine-protein kinase BTK (BTK)
Type:
Enzyme
Mol. Mass.:
76289.95
Organism:
Homo sapiens (Human)
Description:
Q06187
Residue:
659
  
Inhibitor
Name:
BDBM499790
Synonyms:
N-(cis-4-((5-(2-chlorobenzoyl)-7H- pyrrolo[2,3-d]pyrimidin-4- yl)amino)cyclohexyl)-1- hydroxycyclopropane-1-carboxamide | US11020398, Compound I-102
Type:
Small organic molecule
Emp. Form.:
C23H24ClN5O3
Mol. Mass.:
453.921
SMILES:
OC1(CC1)C(=O)N[C@H]1CC[C@H](CC1)Nc1ncnc2[nH]cc(C(=O)c3ccccc3Cl)c12
: