Target
Tyrosine-protein kinase BTK
Ligand
BDBM499815
Substrate
Meas. Tech.
Mobility Shift Assay (MSA) Type B
IC50
1.63±n/a nM
Citation
 Bates, CEathiraj, SInagaki, HLapierre, JMomose, TNakayama, KOdagiri, TOta, MOta, YShibata, YTandon, MTsunemi, T Amino-pyrrolopyrimidinone compounds and methods of use thereof US Patent  US11020398 Publication Date 6/1/2021 
Target
Name:
Tyrosine-protein kinase BTK
Synonyms:
AGMX1 Agammaglobulinaemia tyrosine kinase B cell progenitor kinase BPK BTK_HUMAN Tyrosine Kinase BTK Tyrosine-protein kinase BTK (BTK)
Type:
Enzyme
Mol. Mass.:
76289.95
Organism:
Homo sapiens (Human)
Description:
Q06187
Residue:
659
  
Inhibitor
Name:
BDBM499815
Synonyms:
N-(((2S,5R)-5-((5-(2-chloro-4- phenoxybenzoyl)-7H-pyrrolo[2,3- d]pyrimidin-4-yl)amino)tetrahydro-2H- pyran-2-yl)methyl)acetamide | US11020398, Compound I-127
Type:
Small organic molecule
Emp. Form.:
C27H26ClN5O4
Mol. Mass.:
519.979
SMILES:
CC(=O)NC[C@@H]1CC[C@H](CO1)Nc1ncnc2[nH]cc(C(=O)c3ccc(Oc4ccccc4)cc3Cl)c12
: