Target
Tyrosine-protein kinase BTK [C481S]
Ligand
BDBM499813
Substrate
Meas. Tech.
Radiometric Assay
IC50
0.370±n/a nM
Citation
 Bates, CEathiraj, SInagaki, HLapierre, JMomose, TNakayama, KOdagiri, TOta, MOta, YShibata, YTandon, MTsunemi, T Amino-pyrrolopyrimidinone compounds and methods of use thereof US Patent  US11020398 Publication Date 6/1/2021 
Target
Name:
Tyrosine-protein kinase BTK [C481S]
Synonyms:
AGMX1 BPK BTK C481S Tyrosine-protein kinase BTK (C481S) | Tyrosine-protein kinase BTK C481S
Type:
Enzyme Catalytic Domain
Mol. Mass.:
76273.88
Organism:
Homo sapiens (Human)
Description:
Q06187[C481S]
Residue:
659
  
Inhibitor
Name:
BDBM499813
Synonyms:
(2-chloro-4-phenoxyphenyl)(4- (((3R,6R)-6-(hydroxymethyl)tetrahydro- 2H-pyran-3-yl)amino)-7H-pyrrolo[2,3- d]pyrimidin-5-yl)methanone | US11020398, Compound I-125
Type:
Small organic molecule
Emp. Form.:
C25H23ClN4O4
Mol. Mass.:
478.928
SMILES:
OC[C@H]1CC[C@H](CO1)Nc1ncnc2[nH]cc(C(=O)c3ccc(Oc4ccccc4)cc3Cl)c12
: