Target
Tyrosine-protein kinase BTK
Ligand
BDBM499974
Substrate
Meas. Tech.
Alpha Screen Assay
IC50
0.980±n/a nM
Citation
 Bates, CEathiraj, SInagaki, HLapierre, JMomose, TNakayama, KOdagiri, TOta, MOta, YShibata, YTandon, MTsunemi, T Amino-pyrrolopyrimidinone compounds and methods of use thereof US Patent  US11020398 Publication Date 6/1/2021 
Target
Name:
Tyrosine-protein kinase BTK
Synonyms:
AGMX1 Agammaglobulinaemia tyrosine kinase B cell progenitor kinase BPK BTK_HUMAN Tyrosine Kinase BTK Tyrosine-protein kinase BTK (BTK)
Type:
Enzyme
Mol. Mass.:
76289.95
Organism:
Homo sapiens (Human)
Description:
Q06187
Residue:
659
  
Inhibitor
Name:
BDBM499974
Synonyms:
(racemic)-1-(2-(((5-(2-chloro-4- phenoxybenzoyl)-7H-pyrrolo[2,3- d]pyrimidin-4- yl)amino)methyl)pyrrolidin-1-yl)but-2- yn-1-one | US11020398, Compound I-328r
Type:
Small organic molecule
Emp. Form.:
C28H24ClN5O3
Mol. Mass.:
513.975
SMILES:
CC#CC(=O)N1CCCC1CNc1ncnc2[nH]cc(C(=O)c3ccc(Oc4ccccc4)cc3Cl)c12
: