Target
Xanthine dehydrogenase/oxidase
Ligand
BDBM500009
Substrate
Meas. Tech.
Determination of Xanthine Oxidase Inhibitory Activity of Aryl Benzofuran Amidated Derivatives and Reagents (Amino Derivatives)
IC50
>60000±n/a nM
Citation
 Chen, J Type of aryl benzofuran amidated derivative and medical use thereof US Patent  US11021454 Publication Date 6/1/2021 
Target
Name:
Xanthine dehydrogenase/oxidase
Synonyms:
XD XDHA XO Xanthine dehydrogenase/oxidase | Xanthine oxidase
Type:
Enzyme
Mol. Mass.:
146441.21
Organism:
Homo sapiens (Human)
Description:
P47989
Residue:
1333
  
Inhibitor
Name:
BDBM500009
Synonyms:
US11021454, Compound 10a
Type:
Small organic molecule
Emp. Form.:
C29H27NO9
Mol. Mass.:
533.526
SMILES:
COc1ccc(cc1OC)-c1cc2c(\C=C\C(=O)N[C@@H](Cc3ccc(O)c(O)c3)C(O)=O)ccc(OC)c2o1
: